{"text_format":"1","workbook":"xlsx","n_sheets":10,"sheets":["Informações","Ações gerais","Ações Cultura Viva","Operacionalização","Lista de Contemplados Geral","Lista Contemplados PNCV","Dados","Config","MapaCPFsGeral","MapaCPFsPNCV"],"not_rendered":{"charts":0,"images":5,"macros":1,"external_links":0,"defined_names":5,"comments":2,"pivot_tables":0},"unopened":[],"bounds":{"document_bytes":16777216,"sheet_cells":100000,"rows_first":2000,"rows_last":500,"rows_between":2000,"halvings":0,"cell_chars":16384,"cell_head_chars":4096},"cells_cut":0,"cells_raw":0,"read":"whole","date_system":"1900"}

{"sheet":"Informações","index":0,"n_rows":30,"n_cols":7,"rows_kept":30,"cut":false,"hidden":false,"merged":[[29,1,29,6],[27,2,27,3],[26,2,26,3],[18,4,18,6],[19,4,19,6],[21,0,21,6],[22,5,22,6],[23,5,23,6],[24,1,24,6],[28,2,28,3],[11,0,11,6],[13,0,13,6],[14,2,14,4],[15,2,15,4],[17,0,17,6],[3,0,3,6],[7,0,7,6],[1,0,1,6],[4,5,4,6],[5,5,5,6],[4,0,4,1],[5,0,5,1],[4,3,4,4],[5,3,5,4]]}
[]
["GOVERNO FEDERAL\nMinistério da Cultura\nPolítica Nacional Aldir Blanc\nPlanilha de Acompanhamento Ciclo 1"]
[]
["Informações do Município"]
["Nome do município",null,"UF","CNPJ:",null,"Código do plano de ação do ciclo 1"]
["SANTA CRUZ",null,"PB","08.999-690/0001-46",null,3.0882120230050099E+18]
[]
["Informações Financeiras"]
["Valor recebido no ciclo 1 da política","Valor revertido ao estado\n (se houver)","Valor devolvido à União via pagamento de GRU \n(se houver)","Valor ainda bloqueado judicialmente \n(se houver)","Transferiu recursos para outra conta de mesma titularidade ao longo da execução ?","Saldo em conta ao final da execução do ciclo 1","Valor transferido da conta do ciclo 1 para conta do ciclo 2"]
[60665.64,0,0,0,"Sim",16920.189999999999,16020.19]
[]
["Resumo das informações das outras abas (preenchimento automático)"]
[]
["Panorama geral - ações gerais, cultura viva e operacionalização"]
[null,null,"Valor total"]
[null,null,{"$f":"SUM(A20+A24+C29)","v":49139.17}]
[]
["Ações gerais"]
["Valor total das atividades","Quantidade de vagas ofertadas","Nº de inscritos","Nº de contemplados","Nº de atividades com recursos para áreas periféricas e/ou de povos tradicionais."]
[{"$f":"'Ações gerais'!D204","v":46105.89},{"$f":"'Ações gerais'!E204","v":2},{"$f":"'Ações gerais'!F204","v":2},{"$f":"'Ações gerais'!G204","v":2},{"$f":"COUNTIF('Ações gerais'!H4:H203,\"Sim\")","v":0}]
[]
["Política Nacional Cultura Viva"]
["Valor total dos editais","Quantidade de vagas ofertadas","Nº de inscritos","Nº de novos pontos credenciados","Número de contemplados","Nº de atividades com recursos para áreas periféricas e/ou de povos tradicionais."]
[{"$f":"'Ações Cultura Viva'!D64","v":0},{"$f":"'Ações Cultura Viva'!E64","v":0},{"$f":"'Ações Cultura Viva'!F64","v":0},{"$f":"'Ações Cultura Viva'!G64","v":0},{"$f":"'Ações Cultura Viva'!H64","v":0},{"$f":"COUNTIF('Ações Cultura Viva'!I4:I63,\"Sim\")","v":0}]
["Situação:",{"$f":"IF(A10=\"\",\"\",IF(A10>=360000,IF(A24>=0.25*A10,\"A soma dos editais lançados corresponde ao valor obrigatório da PNCV.\",\"Atenção! A soma dos valores dos editais não corresponde ao valor mínimo obrigatório para PNCV.\"),\"\"))","v":""}]
[]
[null,null,"Operacionalização"]
[null,null,"Valor total"]
[null,null,{"$f":"Operacionalização!D94","v":3033.28}]
["Situação: ",{"$f":"IF(OR(A10=\"\",C29=0),\"\",IF(OR(0.05*A10<C29,C29>6000000), \"Atenção! A soma dos valores não corresponde ao valor máximo permitido para operacionalização.\", \"O município observou o percentual estabelecido na legislação para operacionalização.\"))","v":"O município observou o percentual estabelecido na legislação para operacionalização."}]

{"sheet":"Ações gerais","index":1,"n_rows":204,"n_cols":10,"rows_kept":204,"cut":false,"hidden":false,"merged":[[0,0,0,3]]}
["GOVERNO FEDERAL\nMinistério da Cultura\nPolítica Nacional Aldir Blanc\nPlanilha de Acompanhamento Ciclo 1"]
[{"$f":"CONCATENATE(\"AÇÕES GERAIS - LISTA DE ATIVIDADES - \",UPPER(Informações!A6),\" - \",Informações!C6,\" \",IF(Informações!D6=\"\",\"\",CONCATENATE(\"- CNPJ \",Informações!D6)))","v":"AÇÕES GERAIS - LISTA DE ATIVIDADES - SANTA CRUZ - PB - CNPJ 08.999-690/0001-46"}]
["NOME DA ATIVIDADE \n(editais de fomento cultural, aquisição de bens e serviços culturais, contratação de serviços, obras e reformas)","BREVE DESCRIÇÃO DA ATIVIDADE","FORMA DE EXECUÇÃO\n(Selecione um dos itens a seguir)","VALOR TOTAL DA ATIVIDADE","QUANTIDADE DE VAGAS OFERTADAS","Nº DE INSCRITOS","Nº DE CONTEMPLADOS","A atividade destina recursos para áreas periféricas e/ou de povos tradicionais?","Link da publicação do edital no diário oficial ou extratos das parcerias e contratações","Observação"]
["EDITAL DE FOMENTO CULTURAL Nº 001/2024","SELEÇÃO DE PROJETOS PARA APRESSENTAÇÕES MUSICAIS","Chamamento público - Fomento à execução de ações culturais - Projeto (Decreto 11.453/2023 e Lei 14.903/2024) ",46105.89,2,2,2,"Não","https://santacruz.pb.gov.br/lei-aldir-blanc.php","POR EQUÍVOCO DO SETOR FINANCEIRO, ESSE RECURSO SAIU DA CONTA DA LPG"]
[]
[]
[]
[]
[]
[]
[]
[]
[]
[]
[]
[]
[]
[]
[]
[]
[]
[]
[]
[]
[]
[]
[]
[]
[]
[]
[]
[]
[]
[]
[]
[]
[]
[]
[]
[]
[]
[]
[]
[]
[]
[]
[]
[]
[]
[]
[]
[]
[]
[]
[]
[]
[]
[]
[]
[]
[]
[]
[]
[]
[]
[]
[]
[]
[]
[]
[]
[]
[]
[]
[]
[]
[]
[]
[]
[]
[]
[]
[]
[]
[]
[]
[]
[]
[]
[]
[]
[]
[]
[]
[]
[]
[]
[]
[]
[]
[]
[]
[]
[]
[]
[]
[]
[]
[]
[]
[]
[]
[]
[]
[]
[]
[]
[]
[]
[]
[]
[]
[]
[]
[]
[]
[]
[]
[]
[]
[]
[]
[]
[]
[]
[]
[]
[]
[]
[]
[]
[]
[]
[]
[]
[]
[]
[]
[]
[]
[]
[]
[]
[]
[]
[]
[]
[]
[]
[]
[]
[]
[]
[]
[]
[]
[]
[]
[]
[]
[]
[]
[]
[]
[]
[]
[]
[]
[]
[]
[]
[]
[]
[]
[]
[]
[]
[]
[]
[]
[]
[]
[]
[]
[]
[]
[]
[]
[]
[]
{"$rows_left_out":5}
{"sheet":"Ações Cultura Viva","index":2,"n_rows":64,"n_cols":13,"rows_kept":64,"cut":false,"hidden":false,"merged":[[0,0,0,6]]}
["GOVERNO FEDERAL\nMinistério da Cultura\nPolítica Nacional Aldir Blanc\nPlanilha de Acompanhamento Ciclo 1"]
[{"$f":"CONCATENATE(\"CULTURA VIVA - LISTA DE EDITAIS - \",UPPER(Informações!A6),\" - \",Informações!C6,\" - \",\" \",IF(Informações!D6=\"\",\"\",CONCATENATE(\"CNPJ \",Informações!D6)))","v":"CULTURA VIVA - LISTA DE EDITAIS - SANTA CRUZ - PB -  CNPJ 08.999-690/0001-46"}]
["TIPO EDITAL CULTURA VIVA","NÚMERO E TÍTULO DO EDITAL","BREVE DESCRIÇÃO DO EDITAL","VALOR TOTAL DO EDITAL","QUANTIDADE DE VAGAS OFERTADAS","Nº DE INSCRITOS","Nº DE NOVOS PONTOS CREDENCIADOS","Nº DE CONTEMPLADOS","A atividade destina recursos para áreas periféricas e/ou de povos tradicionais?","Link da publicação do edital no diário oficial","Observação","LINK DE PUBLICAÇÃO DO CHAMAMENTO/EDITAL","Observação"]
[]
[]
[]
[]
[]
[]
[]
[]
[]
[]
[]
[]
[]
[]
[]
[]
[]
[]
[]
[]
[]
[]
[]
[]
[]
[]
[]
[]
[]
[]
[]
[]
[]
[]
[]
[]
[]
[]
[]
[]
[]
[]
[]
[]
[]
[]
[]
[]
[]
[]
[]
[]
[]
[]
[]
[]
[]
[]
[]
[]
[null,null,"Total",{"$f":"SUM(D4:D63)","v":0},{"$f":"SUM(E4:E63)","v":0},{"$f":"SUM(F4:F63)","v":0},{"$f":"SUM(G4:G63)","v":0},{"$f":"SUM(H4:H63)","v":0}]

{"sheet":"Operacionalização","index":3,"n_rows":94,"n_cols":6,"rows_kept":94,"cut":false,"hidden":false,"merged":[[1,0,1,5],[0,0,0,14]]}
["GOVERNO FEDERAL\nMinistério da Cultura\nPolítica Nacional Aldir Blanc\nPlanilha de Acompanhamento Ciclo 1"]
[{"$f":"CONCATENATE(\"CONTRATAÇÕES PARA OPERACIONALIZAÇÃO DA POLÍTICA - \",UPPER(Informações!A6),\" - \",Informações!C6,\" \",IF(Informações!D6=\"\",\"\",CONCATENATE(\"- CNPJ \",Informações!D6)))","v":"CONTRATAÇÕES PARA OPERACIONALIZAÇÃO DA POLÍTICA - SANTA CRUZ - PB - CNPJ 08.999-690/0001-46"}]
["ITEM","DESCRIÇÃO","FORMA DE EXECUÇÃO\n(Selecione um dos itens conforme executado)","VALOR","LINK DE PUBLICAÇÃO DO EXTRATO EM DIÁRIO OFICIAL","Observação"]
["ASSESSORIA","ASSESSORIA PARA LANÇAMENTO E ACOMPANHAMENTO DE EDITAIS","Outras (especifique no campo observação)",3033.28,null,"CONTRATAÇÃO DIRETA"]
[]
[]
[]
[]
[]
[]
[]
[]
[]
[]
[]
[]
[]
[]
[]
[]
[]
[]
[]
[]
[]
[]
[]
[]
[]
[]
[]
[]
[]
[]
[]
[]
[]
[]
[]
[]
[]
[]
[]
[]
[]
[]
[]
[]
[]
[]
[]
[]
[]
[]
[]
[]
[]
[]
[]
[]
[]
[]
[]
[]
[]
[]
[]
[]
[]
[]
[]
[]
[]
[]
[]
[]
[]
[]
[]
[]
[]
[]
[]
[]
[]
[]
[]
[]
[]
[]
[]
[]
[]
[null,null,"TOTAL",{"$f":"SUM(D4:D93)","v":3033.28}]

{"sheet":"Lista de Contemplados Geral","index":4,"n_rows":2007,"n_cols":9,"rows_kept":2007,"cut":false,"hidden":false,"merged":[[429,1,429,2],[430,1,430,2],[431,1,431,2],[426,1,426,2],[427,1,427,2],[428,1,428,2],[423,1,423,2],[424,1,424,2],[425,1,425,2],[420,1,420,2],[421,1,421,2],[422,1,422,2],[417,1,417,2],[418,1,418,2],[419,1,419,2],[414,1,414,2],[415,1,415,2],[416,1,416,2],[411,1,411,2],[412,1,412,2],[413,1,413,2],[408,1,408,2],[409,1,409,2],[410,1,410,2],[405,1,405,2],[406,1,406,2],[407,1,407,2],[402,1,402,2],[403,1,403,2],[404,1,404,2],[399,1,399,2],[400,1,400,2],[401,1,401,2],[396,1,396,2],[397,1,397,2],[398,1,398,2],[393,1,393,2],[394,1,394,2],[395,1,395,2],[390,1,390,2],[391,1,391,2],[392,1,392,2],[387,1,387,2],[388,1,388,2],[389,1,389,2],[384,1,384,2],[385,1,385,2],[386,1,386,2],[381,1,381,2],[382,1,382,2],[383,1,383,2],[378,1,378,2],[379,1,379,2],[380,1,380,2],[375,1,375,2],[376,1,376,2],[377,1,377,2],[372,1,372,2],[373,1,373,2],[374,1,374,2],[369,1,369,2],[370,1,370,2],[371,1,371,2],[366,1,366,2],[367,1,367,2],[368,1,368,2],[363,1,363,2],[364,1,364,2],[365,1,365,2],[360,1,360,2],[361,1,361,2],[362,1,362,2],[357,1,357,2],[358,1,358,2],[359,1,359,2],[354,1,354,2],[355,1,355,2],[356,1,356,2],[351,1,351,2],[352,1,352,2],[353,1,353,2],[348,1,348,2],[349,1,349,2],[350,1,350,2],[345,1,345,2],[346,1,346,2],[347,1,347,2],[342,1,342,2],[343,1,343,2],[344,1,344,2],[339,1,339,2],[340,1,340,2],[341,1,341,2],[336,1,336,2],[337,1,337,2],[338,1,338,2],[333,1,333,2],[334,1,334,2],[335,1,335,2],[330,1,330,2],[331,1,331,2],[332,1,332,2],[327,1,327,2],[328,1,328,2],[329,1,329,2],[324,1,324,2],[325,1,325,2],[326,1,326,2],[321,1,321,2],[322,1,322,2],[323,1,323,2],[318,1,318,2],[319,1,319,2],[320,1,320,2],[315,1,315,2],[316,1,316,2],[317,1,317,2],[312,1,312,2],[313,1,313,2],[314,1,314,2],[309,1,309,2],[310,1,310,2],[311,1,311,2],[306,1,306,2],[307,1,307,2],[308,1,308,2],[303,1,303,2],[304,1,304,2],[305,1,305,2],[300,1,300,2],[301,1,301,2],[302,1,302,2],[297,1,297,2],[298,1,298,2],[299,1,299,2],[294,1,294,2],[295,1,295,2],[296,1,296,2],[291,1,291,2],[292,1,292,2],[293,1,293,2],[288,1,288,2],[289,1,289,2],[290,1,290,2],[285,1,285,2],[286,1,286,2],[287,1,287,2],[282,1,282,2],[283,1,283,2],[284,1,284,2],[279,1,279,2],[280,1,280,2],[281,1,281,2],[276,1,276,2],[277,1,277,2],[278,1,278,2],[273,1,273,2],[274,1,274,2],[275,1,275,2],[270,1,270,2],[271,1,271,2],[272,1,272,2],[267,1,267,2],[268,1,268,2],[269,1,269,2],[264,1,264,2],[265,1,265,2],[266,1,266,2],[261,1,261,2],[262,1,262,2],[263,1,263,2],[258,1,258,2],[259,1,259,2],[260,1,260,2],[255,1,255,2],[256,1,256,2],[257,1,257,2],[252,1,252,2],[253,1,253,2],[254,1,254,2],[249,1,249,2],[250,1,250,2],[251,1,251,2],[246,1,246,2],[247,1,247,2],[248,1,248,2],[243,1,243,2],[244,1,244,2],[245,1,245,2],[240,1,240,2],[241,1,241,2],[242,1,242,2],[237,1,237,2],[238,1,238,2],[239,1,239,2],[234,1,234,2],[235,1,235,2],[236,1,236,2],[231,1,231,2],[232,1,232,2],[233,1,233,2],[228,1,228,2],[229,1,229,2],[230,1,230,2],[225,1,225,2],[226,1,226,2],[227,1,227,2],[222,1,222,2],[223,1,223,2],[224,1,224,2],[219,1,219,2],[220,1,220,2],[221,1,221,2],[216,1,216,2],[217,1,217,2],[218,1,218,2],[213,1,213,2],[214,1,214,2],[215,1,215,2],[210,1,210,2],[211,1,211,2],[212,1,212,2],[207,1,207,2],[208,1,208,2],[209,1,209,2],[204,1,204,2],[205,1,205,2],[206,1,206,2],[201,1,201,2],[202,1,202,2],[203,1,203,2],[198,1,198,2],[199,1,199,2],[200,1,200,2],[195,1,195,2],[196,1,196,2],[197,1,197,2],[192,1,192,2],[193,1,193,2],[194,1,194,2],[189,1,189,2],[190,1,190,2],[191,1,191,2],[186,1,186,2],[187,1,187,2],[188,1,188,2],[183,1,183,2],[184,1,184,2],[185,1,185,2],[180,1,180,2],[181,1,181,2],[182,1,182,2],[177,1,177,2],[178,1,178,2],[179,1,179,2],[174,1,174,2],[175,1,175,2],[176,1,176,2],[171,1,171,2],[172,1,172,2],[173,1,173,2],[168,1,168,2],[169,1,169,2],[170,1,170,2],[165,1,165,2],[166,1,166,2],[167,1,167,2],[162,1,162,2],[163,1,163,2],[164,1,164,2],[159,1,159,2],[160,1,160,2],[161,1,161,2],[156,1,156,2],[157,1,157,2],[158,1,158,2],[153,1,153,2],[154,1,154,2],[155,1,155,2],[150,1,150,2],[151,1,151,2],[152,1,152,2],[147,1,147,2],[148,1,148,2],[149,1,149,2],[144,1,144,2],[145,1,145,2],[146,1,146,2],[141,1,141,2],[142,1,142,2],[143,1,143,2],[138,1,138,2],[139,1,139,2],[140,1,140,2],[135,1,135,2],[136,1,136,2],[137,1,137,2],[132,1,132,2],[133,1,133,2],[134,1,134,2],[129,1,129,2],[130,1,130,2],[131,1,131,2],[126,1,126,2],[127,1,127,2],[128,1,128,2],[123,1,123,2],[124,1,124,2],[125,1,125,2],[120,1,120,2],[121,1,121,2],[122,1,122,2],[117,1,117,2],[118,1,118,2],[119,1,119,2],[114,1,114,2],[115,1,115,2],[116,1,116,2],[111,1,111,2],[112,1,112,2],[113,1,113,2],[108,1,108,2],[109,1,109,2],[110,1,110,2],[105,1,105,2],[106,1,106,2],[107,1,107,2],[102,1,102,2],[103,1,103,2],[104,1,104,2],[99,1,99,2],[100,1,100,2],[101,1,101,2],[96,1,96,2],[97,1,97,2],[98,1,98,2],[93,1,93,2],[94,1,94,2],[95,1,95,2],[90,1,90,2],[91,1,91,2],[92,1,92,2],[87,1,87,2],[88,1,88,2],[89,1,89,2],[84,1,84,2],[85,1,85,2],[86,1,86,2],[81,1,81,2],[82,1,82,2],[83,1,83,2],[78,1,78,2],[79,1,79,2],[80,1,80,2],[75,1,75,2],[76,1,76,2],[77,1,77,2],[72,1,72,2],[73,1,73,2],[74,1,74,2],[69,1,69,2],[70,1,70,2],[71,1,71,2],[66,1,66,2],[67,1,67,2],[68,1,68,2],[63,1,63,2],[64,1,64,2],[65,1,65,2],[60,1,60,2],[61,1,61,2],[62,1,62,2],[57,1,57,2],[58,1,58,2],[59,1,59,2],[54,1,54,2],[55,1,55,2],[56,1,56,2],[51,1,51,2],[52,1,52,2],[53,1,53,2],[48,1,48,2],[49,1,49,2],[50,1,50,2],[45,1,45,2],[46,1,46,2],[47,1,47,2],[42,1,42,2],[43,1,43,2],[44,1,44,2],[39,1,39,2],[40,1,40,2],[41,1,41,2],[36,1,36,2],[37,1,37,2],[38,1,38,2],[12,1,12,2],[13,1,13,2],[14,1,14,2],[27,1,27,2],[28,1,28,2],[29,1,29,2],[24,1,24,2],[25,1,25,2],[26,1,26,2],[21,1,21,2],[22,1,22,2],[23,1,23,2],[0,0,0,6],[0,9,2006,9],[2,1,2,2],[9,1,9,2],[10,1,10,2],[11,1,11,2],[6,1,6,2],[7,1,7,2],[8,1,8,2],[3,1,3,2],[4,1,4,2],[5,1,5,2],[18,1,18,2],[19,1,19,2],[20,1,20,2],[15,1,15,2],[33,1,33,2],[34,1,34,2],[35,1,35,2],[30,1,30,2],[31,1,31,2],[32,1,32,2],[16,1,16,2],[17,1,17,2]]}
["GOVERNO FEDERAL\nMinistério da Cultura\nPolítica Nacional Aldir Blanc\nPlanilha de Acompanhamento Ciclo 1"]
[{"$f":"CONCATENATE(\"LISTA DE BENEFICIÁRIOS DOS EDITAIS DE FOMENTO, PARCERIAS, CONTRATOS DAS AÇÕES CULTURAIS E DAS DESPESAS COM OPERACIONALIZAÇÃO - \",UPPER(Informações!A6),\" - \",Informações!C6,\" \",CONCATENATE(\"- CNPJ \",Informações!D6))","v":"LISTA DE BENEFICIÁRIOS DOS EDITAIS DE FOMENTO, PARCERIAS, CONTRATOS DAS AÇÕES CULTURAIS E DAS DESPESAS COM OPERACIONALIZAÇÃO - SANTA CRUZ - PB - CNPJ 08.999-690/0001-46"}]
["Nome da Atividade","Nome do (a) contemplado (a) via fomento ou\ncontratado via licitação e contrato",null,"CPF (anonimizado)","CNPJ","Nome do Projeto \n(apenas para editais de fomento)","Link da Publicação da Lista de Contemplados \n(apenas para editais de fomento)","Valor Pago ao contemplado ou contratado","Observação"]
[{"$error":"#NAME?"},"CESAR GUIMARÃES SARMENTO",null,null,"38.490.396/0001-75","FORRÓ NA PRAÇA","https://santacruz.pb.gov.br/lei-aldir-blanc.php",6105.89,"POR EQUÍVOCO DO SETOR FINANCEIRO, FOI PAGO COM RECURSO DA CONTA DA LPG"]
[{"$error":"#NAME?"},"PRODUZ ENTERTAINMENT CULTURAIS LTDA",null,null,"54.246.021/0001-10","SÃO JOÃO NA PRAÇA","https://santacruz.pb.gov.br/lei-aldir-blanc.php",40000,"POR EQUÍVOCO DO SETOR FINANCEIRO, FOI PAGO COM RECURSO DA CONTA DA LPG"]
[{"$error":"#NAME?"},"ALEXANDRE MARQUES FORMIGA NETO",null,"***973470**",null,null,null,3033.28,"POR EQUÍVOCO DO SETOR FINANCEIRO, FOI PAGO COM RECURSO DA CONTA DA LPG"]
[]
[]
[]
[]
[]
[]
[]
[]
[]
[]
[]
[]
[]
[]
[]
[]
[]
[]
[]
[]
[]
[]
[]
[]
[]
[]
[]
[]
[]
[]
[]
[]
[]
[]
[]
[]
[]
[]
[]
[]
[]
[]
[]
[]
[]
[]
[]
[]
[]
[]
[]
[]
[]
[]
[]
[]
[]
[]
[]
[]
[]
[]
[]
[]
[]
[]
[]
[]
[]
[]
[]
[]
[]
[]
[]
[]
[]
[]
[]
[]
[]
[]
[]
[]
[]
[]
[]
[]
[]
[]
[]
[]
[]
[]
[]
[]
[]
[]
[]
[]
[]
[]
[]
[]
[]
[]
[]
[]
[]
[]
[]
[]
[]
[]
[]
[]
[]
[]
[]
[]
[]
[]
[]
[]
[]
[]
[]
[]
[]
[]
[]
[]
[]
[]
[]
[]
[]
[]
[]
[]
[]
[]
[]
[]
[]
[]
[]
[]
[]
[]
[]
[]
[]
[]
[]
[]
[]
[]
[]
[]
[]
[]
[]
[]
[]
[]
[]
[]
[]
[]
[]
[]
[]
[]
[]
[]
[]
[]
[]
[]
[]
[]
[]
[]
[]
[]
[]
[]
[]
[]
[]
[]
[]
[]
{"$rows_left_out":1808}
{"sheet":"Lista Contemplados PNCV","index":5,"n_rows":2007,"n_cols":8,"rows_kept":2007,"cut":false,"hidden":false,"merged":[[0,8,2006,8],[2006,1,2006,5],[0,0,0,5]]}
["GOVERNO FEDERAL\nMinistério da Cultura\nPolítica Nacional Aldir Blanc (PNAB)\nPlanilha de Acompanhamento Ciclo 1"]
[{"$f":"CONCATENATE(\"LISTA DE CONTEMPLADOS NO CULTURA VIVA - \",UPPER(Informações!A6),\" - \",Informações!C6,\" \",IF(Informações!D6=\"\",\"\",CONCATENATE(\"- CNPJ \",Informações!D6)))","v":"LISTA DE CONTEMPLADOS NO CULTURA VIVA - SANTA CRUZ - PB - CNPJ 08.999-690/0001-46"}]
["NÚMERO E TÍTULO DO EDITAL","Nome do (a) Contemplado (a)","CPF (anonimizado)","CNPJ ","Nome do Projeto","Link da publicação da Lista de Contemplados","Valor pago ao contemplado","Observação"]
[]
[]
[]
[]
[]
[]
[]
[]
[]
[]
[]
[]
[]
[]
[]
[]
[]
[]
[]
[]
[]
[]
[]
[]
[]
[]
[]
[]
[]
[]
[]
[]
[]
[]
[]
[]
[]
[]
[]
[]
[]
[]
[]
[]
[]
[]
[]
[]
[]
[]
[]
[]
[]
[]
[]
[]
[]
[]
[]
[]
[]
[]
[]
[]
[]
[]
[]
[]
[]
[]
[]
[]
[]
[]
[]
[]
[]
[]
[]
[]
[]
[]
[]
[]
[]
[]
[]
[]
[]
[]
[]
[]
[]
[]
[]
[]
[]
[]
[]
[]
[]
[]
[]
[]
[]
[]
[]
[]
[]
[]
[]
[]
[]
[]
[]
[]
[]
[]
[]
[]
[]
[]
[]
[]
[]
[]
[]
[]
[]
[]
[]
[]
[]
[]
[]
[]
[]
[]
[]
[]
[]
[]
[]
[]
[]
[]
[]
[]
[]
[]
[]
[]
[]
[]
[]
[]
[]
[]
[]
[]
[]
[]
[]
[]
[]
[]
[]
[]
[]
[]
[]
[]
[]
[]
[]
[]
[]
[]
[]
[]
[]
[]
[]
[]
[]
[]
[]
[]
[]
[]
[]
[]
[]
[]
[]
[]
[]
{"$rows_left_out":1808}
{"sheet":"Dados","index":6,"n_rows":28,"n_cols":5,"rows_kept":28,"cut":false,"hidden":true,"merged":[]}
["Forma de execução dos recursos","Forma de Execução Operacionalização","A atividade destina recursos para áreas periféricas e/ou de povos tradicionais?","UF","Editais Cultura Viva"]
["Chamamento público - Fomento à execução de ações culturais - Projeto (Decreto 11.453/2023 e Lei 14.903/2024) ","Termo de Colaboração - Parceria MROSC (Lei 13.019/2014)","Sim","AC","Fomento a projetos continuados de Pontos de Cultura"]
["Chamamento público - Apoio a espaços culturais - Projeto (Decreto 11.453/2023 e Lei 14.903/2024) ","Licitação (Lei 14.133/2021)","Não","AL","Fomento a projetos continuados de Pontões de Cultura"]
["Chamamento público - Bolsas Culturais (Decreto 11.453/2023 e Lei 14.903/2024) ","Inexigibilidade (Lei 14.133/2021)",null,"AP","Premiação de Pontos e Pontões de Cultura"]
["Chamamento público - Premiação Cultural (Decreto 11.453/2023 e Lei 14.903/2024) ","Credenciamento (Lei 14.133/2021)",null,"AM"]
["Termo de Colaboração - Parceria MROSC (Lei 13.019/2014)","Dispensa (Lei 14.133/2021)",null,"BA"]
["Termo de Fomento - Parceria MROSC (Lei 13.019/2014) ","Adesão a ata de registro de preço de outro órgão (Lei 14.133/2021)",null,"CE"]
["Licitação (Lei 14.133/2021)","Convênio/descentralização para outro ente público (especifique no campo observação)",null,"DF"]
["Inexigibilidade (Lei 14.133/2021)","Outras (especifique no campo observação)",null,"ES"]
["Credenciamento (Lei 14.133/2021)",null,null,"GO"]
["Dispensa (Lei 14.133/2021)",null,null,"MA"]
["Adesão à ata de registro de preço de outro órgão (Lei 14.133/2021)",null,null,"MT"]
["Convênio/descentralização para outro ente público (especifique no campo observação)",null,null,"MS"]
["Outras (especifique no campo observação)",null,null,"MG"]
[null,null,null,"PA"]
[null,null,null,"PB"]
[null,null,null,"PR"]
["Atividades preenchidas em Ações Gerais","Atividades preenchidas em Cultura Viva",null,"PE"]
[{"$f":"IF(\n  (COUNTA('Ações gerais'!A4:A203) + COUNTA(Operacionalização!A4:A93)) = 0,\n  \"Insira informações na aba Ações gerais/Operacionalização na coluna Nome da Atividade\",\n  _xlfn._xlws.SORT(\n    _xlfn.UNIQUE(\n      _xlfn.VSTACK(\n        IFERROR(_xlfn._xlws.FILTER('Ações gerais'!A4:A203, 'Ações gerais'!A4:A203<>\"\"),\"\"),\n        IFERROR(_xlfn._xlws.FILTER(Operacionalização!A4:A93, Operacionalização!A4:A93<>\"\"),\"\")\n      )\n    )\n  )\n)","v":{"$error":"#NAME?"}},{"$f":"IFERROR(_xlfn._xlws.SORT(_xlfn.UNIQUE(_xlfn._xlws.FILTER('Ações Cultura Viva'!B4:B59,'Ações Cultura Viva'!B4:B59<>\"\"))),\"Insira informações na aba Ações Cultura Viva na coluna Número e título do edital\")","v":"Insira informações na aba Ações Cultura Viva na coluna Número e título do edital"},null,"PI"]
[null,null,null,"RJ"]
[null,null,null,"RN"]
[null,null,null,"RS"]
[null,null,null,"RO"]
[null,null,null,"RR"]
[null,null,null,"SC"]
[null,null,null,"SP"]
[null,null,null,"SE"]
[null,null,null,"TO"]

{"sheet":"Config","index":7,"n_rows":1,"n_cols":2,"rows_kept":1,"cut":false,"hidden":true,"merged":[]}
["Senha","CULTURAFAF2023"]

{"sheet":"MapaCPFsGeral","index":8,"n_rows":98,"n_cols":2,"rows_kept":98,"cut":false,"hidden":true,"merged":[]}
["Original","Anonimizado"]
[11111111111,"***11111***"]
["111.111.111-11","***11111***"]
[11144477735,"***77735***"]
[22255588809,"***88809***"]
[33366699980,"***99980***"]
[44477700046,"***00046***"]
[55588811110,"***11110***"]
[66699922291,"***22291***"]
[77700033357,"***33357***"]
[88811144421,"***44421***"]
[99922255502,"***55502***"]
[33366678,"***66678***"]
[12345678909,"***78909***"]
[98765432100,"***32100***"]
[15975348620,"***48620***"]
[25845678910,"***78910***"]
[35715925869,"***25869***"]
[65498732122,"***32122***"]
[74185296303,"***96303***"]
[85296374144,"***74144***"]
[96374185216,"***85216***"]
[14725836940,"***36940***"]
[11144477735,"***77735***"]
[22255588809,"***88809***"]
[33366699980,"***99980***"]
[44477700046,"***00046***"]
[55588811110,"***11110***"]
[66699922291,"***22291***"]
[77700033357,"***33357***"]
[88811144421,"***44421***"]
[99922255502,"***55502***"]
[33366678,"***66678***"]
[12345678909,"***78909***"]
[98765432100,"***32100***"]
[15975348620,"***48620***"]
[25845678910,"***78910***"]
[35715925869,"***25869***"]
[65498732122,"***32122***"]
[74185296303,"***96303***"]
[85296374144,"***74144***"]
[96374185216,"***85216***"]
[14725836940,"***36940***"]
[11144477735,"***77735***"]
[22255588809,"***88809***"]
[33366699980,"***99980***"]
[44477700046,"***00046***"]
[55588811110,"***11110***"]
[66699922291,"***22291***"]
[77700033357,"***33357***"]
[88811144421,"***44421***"]
[99922255502,"***55502***"]
[33366678,"***66678***"]
[12345678909,"***78909***"]
[98765432100,"***32100***"]
[15975348620,"***48620***"]
[25845678910,"***78910***"]
[35715925869,"***25869***"]
[65498732122,"***32122***"]
[74185296303,"***96303***"]
[85296374144,"***74144***"]
[96374185216,"***85216***"]
[14725836940,"***36940***"]
[11144477735,"***77735***"]
[22255588809,"***88809***"]
[33366699980,"***99980***"]
[44477700046,"***00046***"]
[55588811110,"***11110***"]
[66699922291,"***22291***"]
[77700033357,"***33357***"]
[88811144421,"***44421***"]
[99922255502,"***55502***"]
[33366678,"***66678***"]
[12345678909,"***78909***"]
[98765432100,"***32100***"]
[15975348620,"***48620***"]
[25845678910,"***78910***"]
[35715925869,"***25869***"]
[65498732122,"***32122***"]
[74185296303,"***96303***"]
[85296374144,"***74144***"]
[96374185216,"***85216***"]
[14725836940,"***36940***"]
[6771889602,"***889602**"]
[6771889602,"***889602**"]
[6771889602,"***889602**"]
[12345678909,"***678909**"]
[98765432100,"***432100**"]
[11122233396,"***233396**"]
[22233344405,"***344405**"]
[33344455574,"***455574**"]
[44455566630,"***566630**"]
[55566677708,"***677708**"]
[66677788887,"***788887**"]
[77788899953,"***899953**"]
[88899900001,"***900001**"]
[11229663428,"***663428**"]
["039.119.734-70","***973470**"]

{"sheet":"MapaCPFsPNCV","index":9,"n_rows":70,"n_cols":2,"rows_kept":70,"cut":false,"hidden":true,"merged":[]}
["Original","Anonimizado"]
["111.111.111-11","***11111***"]
["111.444.777-35","***77735***"]
["222.555.888-09","***88809***"]
["333.666.999-80","***99980***"]
["444.777.000-46","***00046***"]
["555.888.111-10","***11110***"]
["666.999.222-91","***22291***"]
["777.000.333-57","***33357***"]
["888.111.444-21","***44421***"]
["999.222.555-02","***55502***"]
[33366678,"***66678***"]
["123.456.789-09","***78909***"]
["987.654.321-00","***32100***"]
["159.753.486-20","***48620***"]
["258.456.789-10","***78910***"]
["357.159.258-69","***25869***"]
["654.987.321-22","***32122***"]
["741.852.963-03","***96303***"]
["852.963.741-44","***74144***"]
["963.741.852-16","***85216***"]
["147.258.369-40","***36940***"]
[11144477735,"***77735***"]
[22255588809,"***88809***"]
[33366699980,"***99980***"]
[44477700046,"***00046***"]
[55588811110,"***11110***"]
[66699922291,"***22291***"]
[77700033357,"***33357***"]
[88811144421,"***44421***"]
[99922255502,"***55502***"]
[33366678,"***66678***"]
[12345678909,"***78909***"]
[98765432100,"***32100***"]
[15975348620,"***48620***"]
[25845678910,"***78910***"]
[35715925869,"***25869***"]
[65498732122,"***32122***"]
[74185296303,"***96303***"]
[85296374144,"***74144***"]
[96374185216,"***85216***"]
[14725836940,"***36940***"]
[11111111111,"***111111**"]
[6771889602,"***889602**"]
[6522255510,"***255510**"]
["111.222.333-96","***233396**"]
["222.333.444-05","***344405**"]
["333.444.555-74","***455574**"]
["444.555.666-30","***566630**"]
["555.666.777-08","***677708**"]
["666.777.888-87","***788887**"]
["777.888.999-53","***899953**"]
["888.999.000-01","***900001**"]
[6771889602,"***889602**"]
[5223665598,"***665598**"]
["067.718.896-02","***889602**"]
[6771889625,"***889625**"]
[6771889602,"***889602**"]
[6771889602,"***889602**"]
[12345678909,"***678909**"]
[98765432100,"***432100**"]
[11122233396,"***233396**"]
[22233344405,"***344405**"]
[33344455574,"***455574**"]
[44455566630,"***566630**"]
[55566677708,"***677708**"]
[66677788887,"***788887**"]
[77788899953,"***899953**"]
[88899900001,"***900001**"]
[6771889602,"***889602**"]